Build error in gnucash-gnome2-dev branch

Priit Laes amd at
Sun Jun 6 12:19:06 EDT 2004

I get this kind of problem:

Making all in test
make[5]: Entering directory `/home/amd/code/gnucash/src/app-file/test'
/bin/sh ../../../libtool --mode=link gcc  -g -O2 -Wall -Wunused   -
Werror   -o test-link  test-link.o ../  -lpopt -lm
gcc -g -O2 -Wall -Wunused -Werror -o .libs/test-link test-link.o  ../.
libs/ -L/usr/lib /home/amd/code/gnucash/src/gnome-
utils/.libs/ /home/amd/code/gnucash/src/network-
utils/.libs/ -L/usr/X11R6/lib /usr/lib/ /usr/lib/ /usr/lib/libgnomeprintui-2-2.
so /usr/lib/ /usr/lib/ /usr/lib/ /usr/lib/ /usr/lib/ -ldb-3 /
so /usr/lib/ /usr/lib/ /usr/lib/ /usr/lib/ -lSM -lICE -lX11 /usr/lib/ /usr/lib/ /usr/lib/ /usr/lib/ /usr/lib/ /usr/lib/ /usr/
lib/ /usr/lib/ /usr/lib/libgconf-2.
so /usr/lib/ /usr/lib/ -lz -lssl -lcrypto -lrt /
usr/lib/ /usr/lib/ /usr/
lib/ /usr/lib/ /usr/lib/libgdk-x11-2.0.
so /usr/lib/ /usr/lib/ /usr/lib/ /usr/lib/ /usr/lib/ /
usr/lib/ /home/amd/code/gnucash/src/app-utils/.libs/ /home/amd/code/gnucash/src/engine/.libs/ /home/amd/code/gnucash/src/engine/.libs/libgw- /home/amd/code/gnucash/src/engine/.libs/ /home/
amd/code/gnucash/src/gnc-module/.libs/ /home/amd/code/
gnucash/src/core-utils/.libs/ /usr/lib/ /
usr/lib/ /usr/lib/ /home/amd/code/gnucash/src/
calculation/.libs/ /usr/lib/ /usr/
lib/ -ldl /usr/lib/ -lcrypt /usr/lib/ -lpthread /usr/lib/ /usr/lib/libglib- /usr/lib/ -lm -Wl,--rpath -Wl,/usr/local/lib/gnucash -
Wl,--rpath -Wl,/usr/local/lib
undefined reference to `gnc_window_show_progress'
collect2: ld returned 1 exit status
make[5]: *** [test-link] Error 1
make[5]: Leaving directory `/home/amd/code/gnucash/src/app-file/test'
make[4]: *** [all-recursive] Error 1
make[4]: Leaving directory `/home/amd/code/gnucash/src/app-file'
make[3]: *** [all] Error 2
make[3]: Leaving directory `/home/amd/code/gnucash/src/app-file'
make[2]: *** [all-recursive] Error 1
make[2]: Leaving directory `/home/amd/code/gnucash/src'
make[1]: *** [all-recursive] Error 1
make[1]: Leaving directory `/home/amd/code/gnucash'
make: *** [all] Error 2

Any ideas?

Priit Laes <amd tt ee>
-------------- next part --------------
A non-text attachment was scrubbed...
Name: not available
Type: application/pgp-signature
Size: 189 bytes
Desc: See on =?ISO-8859-1?Q?s=F5numi?= digitaalselt
	allkirjastatud osa
Url :

More information about the gnucash-devel mailing list