Windows build and gtkprint

David Reiser dbreiser at
Sat Mar 24 20:25:36 EDT 2007

My first attempt at building r15753 under winXP (also upgraded gnome  
to include gtkhtml3.14) ends with:

../../../repos/src/gnome-utils/gnc-html.c: In function `gnc_html_print':
../../../repos/src/gnome-utils/gnc-html.c:1273: warning: implicit  
declaration of function `gtk_html_print'
make[5]: *** [gnc-html.lo] Error 1
make[5]: Leaving directory `/c/soft/gnucash/build/src/gnome-utils'
make[4]: *** [all-recursive] Error 1
make[4]: Leaving directory `/c/soft/gnucash/build/src/gnome-utils'
make[3]: *** [all] Error 2

I also had to put libgnomeprintui back in because libgnomeprint  
depends on it...


David Reiser
dbreiser at

More information about the gnucash-devel mailing list