Gnucash reports

Aurimas Fišeras aurimas at
Sun Jun 2 08:45:03 EDT 2013

2013.06.02 13:39, Geert Janssens rašė:
> I have committed your tag (so not the old reports) to our svn trunk. Thank you very much 
> for this work !

Hello Geert,
compilation fails after your latest commits:

Making all in test
make[5]: Entering directory `./gnucash-git/src/report/standard-reports/test'
Makefile:824: *** unterminated variable reference.  Stop.
make[5]: Leaving directory `./gnucash-git/src/report/standard-reports/test'
make[4]: *** [all-recursive] Error 1
make[4]: Leaving directory `./gnucash-git/src/report/standard-reports'
make[3]: *** [all-recursive] Error 1
make[3]: Leaving directory `./gnucash-git/src/report'
make[2]: *** [all-recursive] Error 1
make[2]: Leaving directory `./gnucash-git/src'
make[1]: *** [all-recursive] Error 1
make[1]: Leaving directory `./gnucash-git'
make: *** [all] Error 2

I build with these options:
./configure --disable-dbi --enable-debug --enable-compile-warnings

More information about the gnucash-devel mailing list