gnucash compilation error

Dan Pescaru dan.pescaru at
Mon Feb 27 12:28:47 EST 2006

make[5]: Entering directory `/home/bogdi/gnucash/src/engine'
if /bin/sh ../../libtool --tag=CC --mode=compile gcc -DHAVE_CONFIG_H -I. -I.
-I. ./.. -I../.. -I../.. -I../..    -I../../lib/libc -I../../src/core-utils
-I../../ src -I../../src/gnc-module -I../../src/business/business-core/
-I../../lib/libqo f/qof -I../../lib/libqof/qof -DGNUCASH -pthread
-I/usr/include/glib-2.0 -I/usr/l ib/glib-2.0/include   -I
/usr/include/g-wrap  -g -O2 -g -Wall -Wunused -Wmissing -prototypes
-Wmissing-declarations   -Werror -Wdeclaration-after-statement -Wno-
pointer-sign -D_FORTIFY_SOURCE=2 -MT gw-engine.lo -MD -MP -MF ".deps/gw-
engine.T po" -c -o gw-engine.lo gw-engine.c; \
then mv -f ".deps/gw-engine.Tpo" ".deps/gw-engine.Plo"; else rm -f
".deps/gw-eng ine.Tpo"; exit 1; fi
 gcc -DHAVE_CONFIG_H -I. -I. -I../.. -I../.. -I../.. -I../..
-I../../lib/libc -I ../../src/core-utils -I../../src -I../../src/gnc-module
-I../../src/business/bus iness-core/ -I../../lib/libqof/qof
-I../../lib/libqof/qof -DGNUCASH -pthread -I/
2.0/include -I /usr/include/g-wrap -g -O2 - g -Wall -Wunused
-Wmissing-prototypes -Wmissing-declarations -Werror -Wdeclarati
on-after-statement -Wno-pointer-sign -D_FORTIFY_SOURCE=2 -MT
gw-engine.lo-MD -M P -MF .deps/gw-
engine.Tpo -c gw-engine.c  -fPIC -DPIC -o .libs/gw-engine.o
cc1: warnings being treated as errors
gw-engine.c: In function 'gw__tmp426_xaccQueryAddDateMatch_wrapper':
gw-engine.c:16599: warning: 'gw__scm_extras[0]' is used uninitialized in
this fu nction
make[5]: *** [gw-engine.lo] Error 1
make[5]: Leaving directory `/home/bogdi/gnucash/src/engine'
make[4]: *** [all-recursive] Error 1
make[4]: Leaving directory `/home/bogdi/gnucash/src/engine'
make[3]: *** [all] Error 2
make[3]: Leaving directory `/home/bogdi/gnucash/src/engine'
make[2]: *** [all-recursive] Error 1
make[2]: Leaving directory `/home/bogdi/gnucash/src'
make[1]: *** [all-recursive] Error 1
make[1]: Leaving directory `/home/bogdi/gnucash'
make: *** [all] Error 2

This is the error i get.

I told you that i have fodore core 4 full install with all updates.
What solutions could be?
have anyone compile gnucash on fedora core 4?

thanks in advance
-------------- next part --------------
An HTML attachment was scrubbed...

More information about the gnucash-user mailing list