Found another compile bug.

Casey Cichon casey at
Fri Oct 31 22:11:46 EDT 2008

I found this when compiling tonight....

gcc -Werror -Wdeclaration-after-statement -Wno-pointer-sign
-D_FORTIFY_SOURCE=2 -g -O2 -Wall -Wunused -Wmissing-prototypes
-Wmissing-declarations -Wno-unused -o .libs/gnucash-bin gnucash-bin.o
-pthread -Wl,--export-dynamic -pthread  /usr/lib/
/usr/lib/ /usr/lib/ -lcrypt
/usr/lib/ -lSM -lICE /usr/lib/
/usr/lib/ /usr/lib/
/usr/lib/ /usr/lib/
/usr/lib/ /usr/lib/
/usr/lib/ /usr/lib/
/usr/lib/ -lrt /usr/lib/
/usr/lib/ /usr/lib/
/usr/lib/ /usr/lib/
/usr/lib/ /usr/lib/ /usr/lib/
/usr/lib/ -ldl /usr/lib/
../../src/gnc-module/.libs/ /usr/lib/
-lpthread -lm  -Wl,--rpath -Wl,/usr/local/lib/gnucash
/usr/local/lib/gnucash/ undefined reference to
collect2: ld returned 1 exit status
make[4]: *** [gnucash-bin] Error 1
make[4]: Leaving directory `/home/casey/downloads/gnucash/src/bin'
make[3]: *** [all-recursive] Error 1
make[3]: Leaving directory `/home/casey/downloads/gnucash/src/bin'
make[2]: *** [all-recursive] Error 1
make[2]: Leaving directory `/home/casey/downloads/gnucash/src'
make[1]: *** [all-recursive] Error 1
make[1]: Leaving directory `/home/casey/downloads/gnucash'
make: *** [all] Error 2
casey at wizkid2:~/downloads/gnucash$

If you need anything else from me, please let me know.


More information about the gnucash-devel mailing list