Error from

Adolf Belka adolf.belka at
Sun Nov 18 13:22:49 EST 2012

Hi Gnucash List,

I am trying to install Gnucash 2.4.11 from source and am getting the 
following error:-

../../src/gnome/.libs/ undefined reference to 
collect2: ld returned 1 exit status
make[4]: *** [gnucash] Error 1
make[4]: Leaving directory `/home/source/gnucash-2.4.11/src/bin'
make[3]: *** [all-recursive] Error 1
make[3]: Leaving directory `/home/source/gnucash-2.4.11/src/bin'
make[2]: *** [all-recursive] Error 1
make[2]: Leaving directory `/home/source/gnucash-2.4.11/src'
make[1]: *** [all-recursive] Error 1
make[1]: Leaving directory `/home/source/gnucash-2.4.11'
make: *** [all] Error 2

I am running Debian squeeze and have been able to successfully install 
the previous versions from source.  I have Googled for the error code 
but have not been able to find any guidance on how to fix this.

Am I missing some dependency that needs to be installed or is there a 
bug here (however not found other people with same problem when googling.

I can provide a copy of the configure & make output if more detail than 
the above error section would help or if I need to provide additional 
info just let me know.



More information about the gnucash-user mailing list